{"text_format":"1","workbook":"xlsx","n_sheets":8,"sheets":["1 | General information","2 | Personnel","3 | Subcontractors","4 | Scope of Accreditation","5 | Management System Documents","6 | Standards & Instruments","7 | Attachments","_config"],"not_rendered":{"charts":0,"images":1,"macros":1,"external_links":0,"defined_names":62,"comments":0,"pivot_tables":0},"unopened":[],"bounds":{"document_bytes":16777216,"sheet_cells":100000,"rows_first":2000,"rows_last":500,"rows_between":2000,"halvings":0,"cell_chars":16384,"cell_head_chars":4096},"cells_cut":0,"cells_raw":0,"read":"whole","date_system":"1900"}

{"sheet":"1 | General information","index":0,"n_rows":59,"n_cols":14,"rows_kept":59,"cut":false,"hidden":false,"merged":[[0,0,0,3],[37,1,37,11],[11,1,11,11],[3,3,3,11],[26,6,26,11],[5,3,5,11],[6,3,6,11],[7,3,7,11],[26,3,26,4],[17,6,17,9],[21,3,21,4],[13,3,20,4],[13,1,19,1],[13,8,13,9],[13,6,13,7],[28,1,34,1],[50,1,50,10],[39,3,39,9],[41,3,41,9],[43,3,43,9],[44,3,44,9],[45,3,45,9],[48,1,48,10],[47,1,47,10],[15,6,15,11],[19,6,19,9],[21,6,21,9],[40,3,40,9],[42,3,42,9],[38,11,39,11],[38,7,38,9],[23,6,23,9],[24,6,24,11],[28,4,28,11],[29,4,29,11],[30,4,30,11],[34,4,34,11],[31,4,31,11],[32,4,32,11],[33,4,33,11]]}
[{"$f":"'4 | Scope of Accreditation'!A1:B1","v":"Calibration Laboratory Department"}]
["DA-09 rev. 00-05"]
[]
[null,"Title",null,"Application for Accreditation of Reference Material Producers (RMP)"]
[]
[null,"Reference",null,"DA-09"]
[null,"Revision",null,"00-05"]
[null,"Date",null,"2018-11-15"]
[]
[]
[]
["1","General"]
[]
[null,"CAB business name",null,null,null,null,"RMP",null,"Number (if available)"]
[]
[null,null,null,null,null,null,"Indicate any further accreditations of the CAB\n(report number, where applicable)"]
[]
[null,null,null,null,null,null,"Calibration Laboratory (UNI CEI EN ISO/IEC17025)"]
[]
[null,null,null,null,null,null,"Test Laboratory (UNI CEI EN ISO/IEC17025)"]
[]
[null,"Website",null,"www.",null,null,"Medical Laboratory (UNI EN ISO 15189)"]
[]
[null,null,null,null,null,null,"Certified management system (ISO 9001)"]
[null,null,null,null,null,null,"Type \"x\" to select"]
[]
[null,"Applicaton for",null,null,null,null,"Select the item of interest\n(each DA-09 relates to a specific application,\ntherefore multiple choice is not allowed)."]
[]
[null,"For the implementation of production at:",null,"Place / Site","Address"]
[]
[]
[]
[]
[]
[]
[]
[]
[null,"List of sections of this DA-09:"]
[null,null,null,null,null,null,null,"[Double click to select / deselect]",null,null,null,"Completed"]
[null,"Sez. 1",null,"General information (this section)"]
[null,"Sez. 2",null,{"$f":"'2 | Personnel'!B5","v":"Personnel"},null,null,null,null,null,null,null,null,null,{"$f":"IF(L41=\"\",-1,0)","v":-1}]
[null,"Sez. 3",null,{"$f":"'3 | Subcontractors'!B5","v":"Subcontractors"},null,null,null,null,null,null,null,null,null,-1]
[null,"Sez. 4",null,{"$f":"'4 | Scope of Accreditation'!B5","v":"Scope of accreditation"},null,null,null,null,null,null,null,null,null,-1]
[null,"Sez. 5",null,{"$f":"'5 | Management System Documents'!B5","v":"Documentation of the Management System - Management and technical procedures"},null,null,null,null,null,null,null,null,null,-1]
[null,"Sez. 6",null,{"$f":"'6 | Standards & Instruments'!B5","v":"List of standards and/or instruments"},null,null,null,null,null,null,null,null,null,-1]
[null,"Sez. 7",null,{"$f":"'7 | Attachments'!B5","v":"Attachments to be sent with the present application"},null,null,null,null,null,null,null,null,null,-1]
[]
[null,"Motivate the case in which one or more sections have not been completed:"]
[]
[]
[null,"I hereby declare that the present DA-09 application, attached specifically to the DA-00 Accreditation Application, is complete in all the required sections, subject to the reasons stated above."]
[]
[null,"Revision"]
[]
[null,"Date"]
[]
[null,"CAB stamp,\nname and signature\nof the Technical Director (1)"]
[]
[null,"(1)",null,"The Director of the Body."]

{"sheet":"2 | Personnel","index":1,"n_rows":30,"n_cols":5,"rows_kept":30,"cut":false,"hidden":false,"merged":[[11,1,11,3],[9,1,9,3],[0,0,0,1],[4,1,4,3],[6,1,6,3],[10,1,10,4]]}
[{"$f":"'4 | Scope of Accreditation'!A1:B1","v":"Calibration Laboratory Department"}]
[{"$f":"'1 | General information'!A2","v":"DA-09 rev. 00-05"}]
[]
[]
["3","Personnel"]
[]
["Aim:","Provide information on the personnel of the organization, in terms of qualification and assigned responsibility."]
[]
["Notes:"]
["(1)","Degree. The professional curriculum, dated and signed, must be attached to the present application (see A.3 in the Annex section)."]
["(2)","Select (multiple selection possibility) between: Direction (unique); Technical Management (even more than one person); UOD / UOT / UOM Manager (if applicable, at most one for each OU); Manager of the Management System (even more than one person); Operator."]
["(3)","Insert any other information deemed useful to better describe the responsibility of the personnel."]
[]
[]
["ID","Name and Surname","Qualification (1)","Role (2)","Notes (3)"]
[1,null,null,"Responsabile del Laboratorio"]
[2]
[3]
[4]
[5]
[6]
[7]
[8]
[9]
[10]
[11]
[12]
[13]
[14]
[15]

{"sheet":"3 | Subcontractors","index":2,"n_rows":27,"n_cols":7,"rows_kept":27,"cut":false,"hidden":false,"merged":[[11,1,11,6],[0,0,0,1],[4,1,4,3],[10,1,10,6],[6,1,6,6],[9,1,9,6],[15,1,17,1],[15,2,17,2],[15,0,17,0],[15,6,17,6],[14,3,14,4],[15,5,17,5],[24,0,26,0],[24,1,26,1],[24,2,26,2],[24,5,26,5],[24,6,26,6],[18,0,20,0],[18,1,20,1],[18,2,20,2],[18,5,20,5],[18,6,20,6],[21,0,23,0],[21,1,23,1],[21,2,23,2],[21,5,23,5],[21,6,23,6]]}
[{"$f":"'4 | Scope of Accreditation'!A1:B1","v":"Calibration Laboratory Department"}]
[{"$f":"'1 | General information'!A2","v":"DA-09 rev. 00-05"}]
[]
[]
["2","Subcontractors"]
[]
["Aim:","Provide information on any subcontractors, or competent bodies to which the reference materials manufacturer relies on part of the production process activities.\nIt is recalled that \"subcontractor\" is a body (public or private company or organization) that guarantees aspects related to processing, handling, evaluation of homogeneity and stability, to the characterization, storage or distribution of reference materials in the name of the Reference material producer on an onerous or non onerous contractual basis."]
[]
["Notes:"]
["(1)","Report the accreditation identifier, where applicable. Leave it empty if the subcontractor does not have accreditation."]
["(2)","Select (possibility of multiple selection) the activities subject to subcontracting."]
["(3)","Insert any other information deemed useful to better describe the contractual relationship with the subcontractor (for example, the reference to the contract - see A.4 section Annexes)."]
[]
[]
["ID","Business name","Address","Possible accreditations (1)",null,"Subcontracted activity (2)","Informazioni contrattuali (3)"]
["SC1",null,null,"Calibration Laboratory\n(UNI CEI EN ISO/IEC17025)"]
[null,null,null,"Test Laboratory \n(UNI CEI EN ISO/IEC17025)"]
[null,null,null,"Medical Laboratory \n(UNI EN ISO 15189)"]
["SC2",null,null,"Calibration Laboratory\n(UNI CEI EN ISO/IEC17025)"]
[null,null,null,"Test Laboratory\n(UNI CEI EN ISO/IEC17025)"]
[null,null,null,"Medical Laboratory\n(UNI EN ISO 15189)"]
["SC3",null,null,"Calibration Laboratory\n(UNI CEI EN ISO/IEC17025)"]
[null,null,null,"Test Laboratory \n(UNI CEI EN ISO/IEC17025)"]
[null,null,null,"Medical Laboratory \n(UNI EN ISO 15189)"]
["SC4",null,null,"Calibration Laboratory\n(UNI CEI EN ISO/IEC17025)"]
[null,null,null,"Test Laboratory \n(UNI CEI EN ISO/IEC17025)"]
[null,null,null,"Medical Laboratory \n(UNI EN ISO 15189)"]

{"sheet":"4 | Scope of Accreditation","index":3,"n_rows":77,"n_cols":13,"rows_kept":77,"cut":false,"hidden":false,"merged":[[15,2,15,3],[6,1,6,8],[10,1,10,7],[11,1,11,7],[0,0,0,1],[9,1,9,7],[12,1,12,7],[4,1,4,10],[1,0,1,1]]}
["Calibration Laboratory Department"]
[{"$f":"'1 | General information'!A2","v":"DA-09 rev. 00-05"}]
[]
[]
["4","Scope of accreditation"]
[]
["Aim:","Indicate the sectors (see Annex 1 to present DA-09), the composition of the material (matrix / analyte), the properties, the measuring ranges and the expanded uncertainties for which the producer requests to be accredited"]
[]
["Notes:"]
["(1)","Indicate any changes with respect to the current accreditation table (in case of Renewal application or Extension/Reduction). [Double click to select / deselect]"]
["(2)","Indicate if it is Certified Reference Material, CRM. [Double click to select / deselect] "]
["(3)","Indicate the characterization method with reference to ISO 17034."]
["(4)","Indicate the procedure (or procedures) relating to the specific accreditation object, using the relative ID in the list of procedures (section 5).",null,null,null,null,null,null,null,"Go to procedures list >>>"]
[]
[]
[null,null,"Material composition"]
["Variation\n(1)","Sector","Matrix","Analyte","CRM\n(2)","Properties","Measurement range \n/ measurement unit","Expanded uncertainty\n/ measurement unit","Method\n(3)","Reference procedure\n(4)","Notes"]
[null,null,null,null,null,null,null,null,null,null,null,null,{"$f":"VLOOKUP(B18,_config!$A$3:$B$41,2)","v":{"$error":"#N/A"}}]
[null,null,null,null,null,null,null,null,null,null,null,null,{"$f":"VLOOKUP(B19,_config!$A$3:$B$41,2)","v":{"$error":"#N/A"}}]
[null,null,null,null,null,null,null,null,null,null,null,null,{"$f":"VLOOKUP(B20,_config!$A$3:$B$41,2)","v":{"$error":"#N/A"}}]
[null,null,null,null,null,null,null,null,null,null,null,null,{"$f":"VLOOKUP(B21,_config!$A$3:$B$41,2)","v":{"$error":"#N/A"}}]
[null,null,null,null,null,null,null,null,null,null,null,null,{"$f":"VLOOKUP(B22,_config!$A$3:$B$41,2)","v":{"$error":"#N/A"}}]
[null,null,null,null,null,null,null,null,null,null,null,null,{"$f":"VLOOKUP(B23,_config!$A$3:$B$41,2)","v":{"$error":"#N/A"}}]
[null,null,null,null,null,null,null,null,null,null,null,null,{"$f":"VLOOKUP(B24,_config!$A$3:$B$41,2)","v":{"$error":"#N/A"}}]
[null,null,null,null,null,null,null,null,null,null,null,null,{"$f":"VLOOKUP(B25,_config!$A$3:$B$41,2)","v":{"$error":"#N/A"}}]
[null,null,null,null,null,null,null,null,null,null,null,null,{"$f":"VLOOKUP(B26,_config!$A$3:$B$41,2)","v":{"$error":"#N/A"}}]
[null,null,null,null,null,null,null,null,null,null,null,null,{"$f":"VLOOKUP(B27,_config!$A$3:$B$41,2)","v":{"$error":"#N/A"}}]
[null,null,null,null,null,null,null,null,null,null,null,null,{"$f":"VLOOKUP(B28,_config!$A$3:$B$41,2)","v":{"$error":"#N/A"}}]
[null,null,null,null,null,null,null,null,null,null,null,null,{"$f":"VLOOKUP(B29,_config!$A$3:$B$41,2)","v":{"$error":"#N/A"}}]
[null,null,null,null,null,null,null,null,null,null,null,null,{"$f":"VLOOKUP(B30,_config!$A$3:$B$41,2)","v":{"$error":"#N/A"}}]
[null,null,null,null,null,null,null,null,null,null,null,null,{"$f":"VLOOKUP(B31,_config!$A$3:$B$41,2)","v":{"$error":"#N/A"}}]
[null,null,null,null,null,null,null,null,null,null,null,null,{"$f":"VLOOKUP(B32,_config!$A$3:$B$41,2)","v":{"$error":"#N/A"}}]
[null,null,null,null,null,null,null,null,null,null,null,null,{"$f":"VLOOKUP(B33,_config!$A$3:$B$41,2)","v":{"$error":"#N/A"}}]
[null,null,null,null,null,null,null,null,null,null,null,null,{"$f":"VLOOKUP(B34,_config!$A$3:$B$41,2)","v":{"$error":"#N/A"}}]
[null,null,null,null,null,null,null,null,null,null,null,null,{"$f":"VLOOKUP(B35,_config!$A$3:$B$41,2)","v":{"$error":"#N/A"}}]
[null,null,null,null,null,null,null,null,null,null,null,null,{"$f":"VLOOKUP(B36,_config!$A$3:$B$41,2)","v":{"$error":"#N/A"}}]
[null,null,null,null,null,null,null,null,null,null,null,null,{"$f":"VLOOKUP(B37,_config!$A$3:$B$41,2)","v":{"$error":"#N/A"}}]
[null,null,null,null,null,null,null,null,null,null,null,null,{"$f":"VLOOKUP(B38,_config!$A$3:$B$41,2)","v":{"$error":"#N/A"}}]
[null,null,null,null,null,null,null,null,null,null,null,null,{"$f":"VLOOKUP(B39,_config!$A$3:$B$41,2)","v":{"$error":"#N/A"}}]
[null,null,null,null,null,null,null,null,null,null,null,null,{"$f":"VLOOKUP(B40,_config!$A$3:$B$41,2)","v":{"$error":"#N/A"}}]
[null,null,null,null,null,null,null,null,null,null,null,null,{"$f":"VLOOKUP(B41,_config!$A$3:$B$41,2)","v":{"$error":"#N/A"}}]
[null,null,null,null,null,null,null,null,null,null,null,null,{"$f":"VLOOKUP(B42,_config!$A$3:$B$41,2)","v":{"$error":"#N/A"}}]
[null,null,null,null,null,null,null,null,null,null,null,null,{"$f":"VLOOKUP(B43,_config!$A$3:$B$41,2)","v":{"$error":"#N/A"}}]
[null,null,null,null,null,null,null,null,null,null,null,null,{"$f":"VLOOKUP(B44,_config!$A$3:$B$41,2)","v":{"$error":"#N/A"}}]
[null,null,null,null,null,null,null,null,null,null,null,null,{"$f":"VLOOKUP(B45,_config!$A$3:$B$41,2)","v":{"$error":"#N/A"}}]
[null,null,null,null,null,null,null,null,null,null,null,null,{"$f":"VLOOKUP(B46,_config!$A$3:$B$41,2)","v":{"$error":"#N/A"}}]
[null,null,null,null,null,null,null,null,null,null,null,null,{"$f":"VLOOKUP(B47,_config!$A$3:$B$41,2)","v":{"$error":"#N/A"}}]
[null,null,null,null,null,null,null,null,null,null,null,null,{"$f":"VLOOKUP(B48,_config!$A$3:$B$41,2)","v":{"$error":"#N/A"}}]
[null,null,null,null,null,null,null,null,null,null,null,null,{"$f":"VLOOKUP(B49,_config!$A$3:$B$41,2)","v":{"$error":"#N/A"}}]
[null,null,null,null,null,null,null,null,null,null,null,null,{"$f":"VLOOKUP(B50,_config!$A$3:$B$41,2)","v":{"$error":"#N/A"}}]
[null,null,null,null,null,null,null,null,null,null,null,null,{"$f":"VLOOKUP(B51,_config!$A$3:$B$41,2)","v":{"$error":"#N/A"}}]
[null,null,null,null,null,null,null,null,null,null,null,null,{"$f":"VLOOKUP(B52,_config!$A$3:$B$41,2)","v":{"$error":"#N/A"}}]
[null,null,null,null,null,null,null,null,null,null,null,null,{"$f":"VLOOKUP(B53,_config!$A$3:$B$41,2)","v":{"$error":"#N/A"}}]
[null,null,null,null,null,null,null,null,null,null,null,null,{"$f":"VLOOKUP(B54,_config!$A$3:$B$41,2)","v":{"$error":"#N/A"}}]
[null,null,null,null,null,null,null,null,null,null,null,null,{"$f":"VLOOKUP(B55,_config!$A$3:$B$41,2)","v":{"$error":"#N/A"}}]
[null,null,null,null,null,null,null,null,null,null,null,null,{"$f":"VLOOKUP(B56,_config!$A$3:$B$41,2)","v":{"$error":"#N/A"}}]
[null,null,null,null,null,null,null,null,null,null,null,null,{"$f":"VLOOKUP(B57,_config!$A$3:$B$41,2)","v":{"$error":"#N/A"}}]
[null,null,null,null,null,null,null,null,null,null,null,null,{"$f":"VLOOKUP(B58,_config!$A$3:$B$41,2)","v":{"$error":"#N/A"}}]
[null,null,null,null,null,null,null,null,null,null,null,null,{"$f":"VLOOKUP(B59,_config!$A$3:$B$41,2)","v":{"$error":"#N/A"}}]
[null,null,null,null,null,null,null,null,null,null,null,null,{"$f":"VLOOKUP(B60,_config!$A$3:$B$41,2)","v":{"$error":"#N/A"}}]
{"$rows_left_out":18}
{"sheet":"5 | Management System Documents","index":4,"n_rows":64,"n_cols":6,"rows_kept":64,"cut":false,"hidden":false,"merged":[[10,1,10,3],[4,1,4,5],[1,0,1,2],[0,0,0,2],[9,1,9,3],[9,4,9,5],[6,1,6,5]]}
[{"$f":"'4 | Scope of Accreditation'!A1:B1","v":"Calibration Laboratory Department"}]
[{"$f":"'1 | General information'!A2","v":"DA-09 rev. 00-05"}]
[]
[]
["6","Documentation of the Management System - Management and technical procedures"]
[]
["Aim:","Identify the documentation of the management system (including management and technical procedures) used by the body, in the current revision status and reporting any changes from previous versions (already positively evaluated by ACCREDIA-DT)."]
[]
["Notes:"]
["(1)","Progressive number, to be used in the description of the Scope of Accreditation (section 4).",null,null,"Go to Accreditation Table >>>"]
["(2)","Indicate any changes to the procedures already positively evaluated by ACCREDIA-DT (in the case of renewal or extension/reduction application). [Double click to select / deselect]"]
[]
[]
["ID\n(1)","Technical /management procedure","Reference / identification code","Title","Revision index","Variation\n(2)"]
[{"$f":"IF(B15=\"\",\"\",1)","v":""}]
[{"$f":"IF(B16=\"\",\"\",IF(A15=\"\",\"\",A15+1))","v":""}]
[{"$f":"IF(B17=\"\",\"\",IF(A16=\"\",\"\",A16+1))","v":""}]
[""]
[""]
[""]
[""]
[""]
[""]
[""]
[""]
[""]
[""]
[""]
[""]
[""]
[""]
[""]
[""]
[""]
[""]
[""]
[""]
[""]
[""]
[""]
[""]
[""]
[""]
[""]
[""]
[""]
[""]
[""]
[""]
[""]
[""]
[""]
[""]
[""]
[""]
[""]
[""]
[""]
[""]
[""]
{"$rows_left_out":5}
{"sheet":"6 | Standards & Instruments","index":5,"n_rows":59,"n_cols":15,"rows_kept":59,"cut":false,"hidden":false,"merged":[[4,1,4,14],[1,0,1,1],[0,0,0,1],[16,10,16,14],[9,1,9,14],[12,1,12,14],[14,1,14,14],[11,1,11,14],[6,1,6,14],[13,1,13,9],[13,10,13,12],[10,1,10,8]]}
[{"$f":"'4 | Scope of Accreditation'!A1:B1","v":"Calibration Laboratory Department"}]
[{"$f":"'1 | General information'!A2","v":"DA-09 rev. 00-05"}]
[]
[]
["7","List of standards and/or instruments"]
[]
["Aim:","Report the complete list of standards and instruments (including those that may not be owned) used by the organization for productions subject to accreditation."]
[]
["Notes:"]
["(1)","Progressive number."]
["(2)","(see UNI CEI 70099: 2008): reference measurement standard (see §5.6) - previously, \"primary measurement standard\"; working measurement standard (see §5.7) - previously, \"secondary measurement standard\"; travelling measurement standard (see §5.8) - usually used for external calibration; transfer measurement device (see §5.9).    "]
["(3)","Select in case the standard/instrument is not owned by the organism. [Double click to select/deselect] Report owner in the next column."]
["(4)","Select if subject to internal calibration."]
["(5)","Indicate the procedure (or procedures) using the relevant ID in the list of procedures (section 5).",null,null,null,null,null,null,null,null,"Go to procedures list >>>"]
["(6)","Do not indicate in the case of internal calibration. [Double click to select/deselect]"]
[]
[null,null,null,null,null,null,null,null,null,"Use","Calibration"]
["ID\n(1)","Type of instrument\n(2)","Not owned\n(3)","Owner","Description","Manufacturer","Manufacturing date (year)","Model/type","Serial number","Procedure\n(5)","Internal\n(4)","Periodicity\n(months)","Procedure\n(5)","Provider\n(6)","Number/date of the last Calibration Certificate"]
[1]
[{"$f":"IF(B20=\"\",\"\",IF(A19=\"\",\"\",(A19+1)))","v":""}]
[{"$f":"IF(B21=\"\",\"\",IF(A20=\"\",\"\",(A20+1)))","v":""}]
[""]
[""]
[""]
[""]
[""]
[""]
[""]
[""]
[""]
[""]
[""]
[""]
[""]
[""]
[""]
[""]
[""]
[""]
[""]
[""]
[""]
[""]
[""]
[""]
[""]
[""]
[""]
[""]
[""]
[""]
[""]
[""]
[""]
[""]
[""]
[""]
[""]
[""]

{"sheet":"7 | Attachments","index":6,"n_rows":29,"n_cols":16,"rows_kept":29,"cut":false,"hidden":false,"merged":[[28,1,28,10],[0,0,0,2],[4,1,4,10],[26,1,26,10],[12,1,12,10],[16,1,16,10],[18,1,18,10],[22,1,22,10],[10,1,10,10],[20,1,20,10],[4,15,6,15],[24,1,24,10],[4,12,6,12],[4,13,6,13],[6,1,6,10],[4,11,6,11],[4,14,6,14],[8,1,8,10],[14,1,14,10]]}
[{"$f":"'4 | Scope of Accreditation'!A1:B1","v":"Calibration Laboratory Department"}]
[{"$f":"'1 | General information'!A2","v":"DA-09 rev. 00-05"}]
[]
[]
["8","Attachments to be sent with the present application",null,null,null,null,null,null,null,null,null,"Accreditation","Extension","Reduction","Renewal","Registry variation/Transfer of ownership"]
[]
["Notes:","Failure to send all the required attachments is sufficient for the non acceptance of the entire application."]
[]
["A.1","Production plan",null,null,null,null,null,null,null,null,null,"X","X","X","X"]
[]
["A.2","Name organization chart of the structure of the body that requires accreditation as a reference materials producer, in which at least the persons listed in section 2 are reported.",null,null,null,null,null,null,null,null,null,"X","X","X","X","X"]
[]
["A.3","Professional curriculum, dated and signed, of all the personnel indicated in section 2.",null,null,null,null,null,null,null,null,null,"X","X",null,"X","X"]
[]
["A.4","Copy of the current contracts with the subcontractors listed in section 3.",null,null,null,null,null,null,null,null,null,"X","X",null,"X","X"]
[]
["A.5","Documents of the Management System in PDF format (in controlled distribution), in compliance with the provisions of ISO 17034,  and with the additional requirements of ACCREDIA, EA and ILAC.",null,null,null,null,null,null,null,null,null,"X","X","X","X","X"]
[]
["A.6","Management and technical procedures (as listed in section 5) - and related attachments -, in the latest revision, in electronic PDF format (in controlled distribution).",null,null,null,null,null,null,null,null,null,"X","X","X","X","X"]
[]
["A.7","Copy of the Calibration Certificates (in electronic PDF format) for the reference measurement standards supplied to the body.",null,null,null,null,null,null,null,null,null,"X","X",null,null,"X"]
[]
["A.8","Possible evidences of participation (or results, if available) to PT and/or ILC.\nIf not otherwise arranged, it is possible to use the scheme in section. 5.2 of the current DA-05.",null,null,null,null,null,null,null,null,null,"X","X",null,"X","X"]
[]
["A.9","Checklist (DT-Mod-014-RMP) duly completed for the body assessment.",null,null,null,null,null,null,null,null,null,"X","X",null,"X","X"]
[]
["A.10","Minutes of the last management review, containing all the information reported in point 8.6 of ISO 17034  including the results of a complete internal audit cycle.",null,null,null,null,null,null,null,null,null,"X"]
[]
["A.11","Assessment of possible effects of the reduction on other accredited fields (see RG-18 6.2.1).",null,null,null,null,null,null,null,null,null,null,null,"X"]

{"sheet":"_config","index":7,"n_rows":41,"n_cols":10,"rows_kept":41,"cut":false,"hidden":true,"merged":[]}
["Grandezze",null,null,"Settore",null,"Tipo di procedura (tecnica/gestionale)",null,"Tipo di campione/strumento",null,"Domanda"]
[]
["(Grandezza non codificata)","NOCOD",null,"[SRM-01] REFERENCE MATERIALS (RM / CRM) - ENVIRONMENTAL MATRIX",null,"Technical",null,"Reference measurement standard",null,"ACCREDITATION"]
["[LAT] ACCELERAZIONE","SAC",null,"[SRM-02] REFERENCE MATERIALS (RM / CRM) - SYNTHETIC SOLUTION",null,"Management",null,"Working measurement standard",null,"EXTENSION"]
["[LAT] ANGOLO PIANO","SAP",null,"[SRM-03] REFERENCE MATERIALS (RM / CRM) - GAS",null,null,null,"Travelling measurement standard",null,"REDUCTION"]
["[LAT] ATTIVITA' CATALITICA","SCT",null,null,null,null,null,"Transfer measurement device",null,"RENEWAL - No modification of CMCs"]
["[LAT] CAMPO ELETTROMAGNETICO","SEM",null,null,null,null,null,null,null,"RENEWAL - Request modification of CMCs"]
["[LAT] CONCENTRAZIONE DI QUANTITA' DI SOSTANZA","SCQ",null,null,null,"Ruolo",null,"Attività di produzione",null,"ANAGRAPHIC VARIATIONS / TRANSFER OF ACCREDITATION"]
["[LAT] CONDUCIBILITA' ELETTROLITICA","SCL"]
["[LAT] DEFORMAZIONE","SDE",null,null,null,"Responsabile del Laboratorio",null,"Material processing"]
["[LAT] DUREZZA","SDR",null,null,null,"Sostituto del Responsabile",null,"Material handling",null,"Luogo di taratura/produzione"]
["[LAT] FORZA","SFO",null,null,null,"Responsabile UOD",null,"Assessment of homogeneity"]
["[LAT] FRAZIONE DI QUANTITA' DI SOSTANZA","SFQ",null,null,null,"Responsabile del Sistema di Gestione",null,"Assessment of stability",null,"permanent laboratory"]
["[LAT] INDUZIONE MAGNETICA","SIM",null,null,null,"Assistente del Responsabile del Sistema di Gestione",null,"Characterization",null,"detached operational unit (UOD)"]
["[LAT] IRRADIANZA","SIR",null,null,null,"Operatore",null,"Material storage",null,"temporary operational unit (UOT) "]
["[LAT] LUNGHEZZA","SLN",null,null,null,null,null,"Distribution",null,"mobile operational unit (UOM)"]
["[LAT] MASSA","SMA"]
["[LAT] MASSA VOLUMICA","SMV",null,null,null,"Direction"]
["[LAT] MISURE A RADIOFREQUENZA (RF)","SRF",null,null,null,"Technical Management"]
["[LAT] MISURE ACUSTICHE","SAU",null,null,null,"UOD/UOT/UOM Manager"]
["[LAT] MISURE DI TEMPO E FREQUENZA","STF",null,null,null,"Management System Manager"]
["[LAT] MISURE ELETTRICHE IN CONTINUA E BASSA FREQUENZA","SBF",null,null,null,"Operator"]
["[LAT] MISURE OTTICHE","SOT"]
["[LAT] MOMENTO TORCENTE","SMT"]
["[LAT] pH","SPH"]
["[LAT] PORTATA","SPO"]
["[LAT] PORTATA IN VOLUME","SPV"]
["[LAT] PORTATA IN VOLUME DI LIQUIDI","SPL"]
["[LAT] POTENZA TERMICA","SPT"]
["[LAT] PRESSIONE","SPR"]
["[LAT] QUANTITA' DI SOSTANZA","SQS"]
["[LAT] RADIAZIONI IONIZZANTI","SRI"]
["[LAT] TEMPERATURA","STE"]
["[LAT] TEMPERATURA DI RUGIADA","STR"]
["[LAT] UMIDITA' RELATIVA","SHR"]
["[LAT] VELOCITA'","SVE"]
["[LAT] VELOCITA' DELL'ARIA","SVA"]
["[LAT] VOLUME","SVO"]
["[LAT] VOLUME STATICO DI LIQUIDI","SVS"]
["[LAT] VOLUME TOTALIZZATO DI LIQUIDI","SVT"]
["[RMP] MATERIALI DI RIFERIMENTO","SRM"]