{"text_format":"1","workbook":"xlsx","n_sheets":11,"sheets":["0 | Cover","1 | Informazioni generali","2 | Personale","3 | Subappaltatori","4.1 | Scopo accreditamento CRM","4.2 | Scopo accreditamento RM","4 | Scopo di accreditamento","5 | Documenti sistema gestione","6 | Campioni e strumenti","7 | Allegati","_config"],"not_rendered":{"charts":0,"images":1,"macros":1,"external_links":1,"defined_names":111,"comments":0,"pivot_tables":0},"unopened":[],"bounds":{"document_bytes":16777216,"sheet_cells":100000,"rows_first":2000,"rows_last":500,"rows_between":2000,"halvings":0,"cell_chars":16384,"cell_head_chars":4096},"cells_cut":0,"cells_raw":0,"read":"whole","date_system":"1900"}

{"sheet":"0 | Cover","index":0,"n_rows":22,"n_cols":14,"rows_kept":22,"cut":false,"hidden":false,"merged":[[21,1,28,11],[0,0,0,3],[2,3,2,4],[2,6,2,11],[3,3,3,4],[3,6,3,11],[4,3,4,11],[5,3,5,11],[6,3,6,11],[8,1,8,11],[10,1,17,11],[19,1,19,11]]}
["Dipartimento Laboratori di Taratura"]
[]
[null,"Titolo / Title",null,"Domanda di accreditamento per Produttori di Materiali di Riferimento (RMP)",null,null,"in conformità alla norma UNI CEI EN ISO 17034:2017"]
[null,null,null,"Application for Accreditation of Reference Material Producers (RMP)",null,null,"in accordance to the standard ISO 17034:2016"]
[null,"Sigla / Reference",null,"DA-09",null,null,null,null,null,null,null,null,null,{"$f":"CONCATENATE(D5,\" rev. \",D6)","v":"DA-09 rev. 01-05"}]
[null,"Revisione / Revision",null,"01-05"]
[null,"Entrata in vigore / Application date",null,"03-02-2025"]
[]
[null,"Note di revisione"]
[]
[null,"La struttura complessiva del documento della domanda DA-09 (ora in rev. 01) non è stata modificata, tuttavia si sono apportate le modifiche di seguito indicate:\n- Aggiunta della presente sezione (Cover) con le informazioni relative alla revisione corrente della DA-09;\n- Revisione grafica a seguito di entrata in vigore della nuova corporate Accredia;\n- Sez. 1: aggiornamento delle possibili istanze della domanda;\n- Sez. 2: modifica voci campo \"Ruolo\";\n- Sez. 3: aggiunte voci \"Altro\" sia per accreditamenti sia per attiivtà in subappalto;\n- Sez. 4: divisa in due sezioni distinte, 4.1 e 4.2, dedicate rispettivamente allo scopo di accreditamento per CRM e per RM;\n- Sez. 4.1, 4.2: aggiunto campo \"Tipologia\" per definire il tipo di CRM/RM;\n- Sez. 6: aggiunta voce \"Materiale di riferimento certificato (CRM)\" per tipo di strumento;\n- Sez. 7: aggiornamento delle possibili istanze della domanda e dei relativi allegati.\n\nL'All. 1 “Aree metrologiche-settori RMP” (emesso in rev. 05) non è stato oggetto di aggiornamento."]
[]
[]
[]
[]
[]
[]
[]
[]
[null,"Note alla compilazione"]
{"$rows_left_out":3}
{"sheet":"1 | Informazioni generali","index":1,"n_rows":58,"n_cols":12,"rows_kept":58,"cut":false,"hidden":false,"merged":[[47,1,47,10],[49,1,49,10],[51,6,51,10],[53,6,53,10],[12,3,12,4],[12,8,12,11],[39,3,39,9],[40,3,40,9],[42,3,42,9],[43,3,43,9],[44,3,44,9],[46,1,46,10],[32,4,32,10],[33,4,33,10],[35,1,35,11],[36,7,36,11],[37,3,37,9],[38,3,38,9],[21,3,21,4],[21,6,21,11],[23,3,23,11],[25,4,25,11],[16,6,19,11],[18,3,18,4],[26,1,33,1],[26,4,26,10],[27,4,27,10],[28,4,28,10],[29,4,29,10],[30,4,30,10],[41,3,41,9],[0,0,0,3],[3,1,3,11],[5,1,7,1],[5,3,7,4],[5,6,5,7],[5,8,5,9],[7,6,7,11],[8,3,8,4],[8,6,8,11],[10,1,18,1],[10,3,10,4],[10,8,10,11],[14,3,14,4],[14,8,14,11],[16,3,16,4]]}
["Dipartimento Laboratori di Taratura"]
[{"$f":"REV_DA","v":"DA-09 rev. 01-05"}]
[]
["1","Generalità"]
[]
[null,"Ragione sociale\ndel CAB",null,null,null,null,"RMP",null,"Numero (se disponibile)"]
[]
[]
[null,"Sito web",null,"www.",null,null,"[Digitare \"x\" nella casella di sinistra, poi riportare a destra\n i riferimenti dell'accreditamento]"]
[]
[null,"Indicare eventuali ulteriori accreditamenti \ne/o certificazioni del CAB",null,"Laboratorio di taratura (ISO/IEC 17025)"]
[]
[null,null,null,"Laboratorio di prova (ISO/IEC 17025)"]
[]
[null,null,null,"Laboratorio medico (ISO 15189)"]
[]
[null,null,null,"Altri accreditamenti/certificazioni [Specificare a lato]"]
[]
[]
[]
{"$rows_left_out":39}
{"sheet":"2 | Personale","index":2,"n_rows":103,"n_cols":6,"rows_kept":103,"cut":false,"hidden":false,"merged":[[0,0,0,4],[12,3,12,4],[13,5,18,5],[13,1,18,1],[13,2,18,2],[13,0,18,0],[10,1,10,4],[8,1,8,4],[3,1,3,4],[5,1,5,4],[9,1,9,5],[19,0,24,0],[19,1,24,1],[19,2,24,2],[19,5,24,5],[25,0,30,0],[25,1,30,1],[25,2,30,2],[25,5,30,5],[31,0,36,0],[31,1,36,1],[31,2,36,2],[31,5,36,5],[37,0,42,0],[37,1,42,1],[37,2,42,2],[37,5,42,5],[43,0,48,0],[43,1,48,1],[43,2,48,2],[43,5,48,5],[49,0,54,0],[49,1,54,1],[49,2,54,2],[49,5,54,5],[55,0,60,0],[55,1,60,1],[55,2,60,2],[55,5,60,5],[61,0,66,0],[61,1,66,1],[61,2,66,2],[61,5,66,5],[67,0,72,0],[67,1,72,1],[67,2,72,2],[67,5,72,5],[73,0,78,0],[73,1,78,1],[73,2,78,2],[73,5,78,5],[79,0,84,0],[79,1,84,1],[79,2,84,2],[79,5,84,5],[85,0,90,0],[85,1,90,1],[85,2,90,2],[85,5,90,5],[91,0,96,0],[91,1,96,1],[91,2,96,2],[91,5,96,5],[97,0,102,0],[97,1,102,1],[97,2,102,2],[97,5,102,5]]}
["Dipartimento Laboratori di Taratura"]
[{"$f":"REV_DA","v":"DA-09 rev. 01-05"}]
[]
["2","Personale"]
[]
["Scopo:","Fornire informazioni relative al personale dell'organismo, in termini di qualifica e di responsabilità assegnata."]
[]
["Note:"]
["(1)","Titolo di studio. Il curriculum professionale, datato e firmato, deve essere allegato alla presente domanda (cfr. A.3 nella sez. Allegati)."]
["(2)","Selezionare (possibilità di selezione multipla, digitare \"x\" nella casellina di sinistra) tra: Direzione (unica); Direzione tecnica (anche più persone); Responsabile processi non subappaltabili (anche più persone); Responsabile del Sistema di Gestione (anche più persone); Operatore ; Altro (da specificare nel campo \"Note\")."]
["(3)","Inserire ogni altra informazione si ritenga utile per meglio descrivere la responsabilità del personale."]
[]
["ID","Nome e Cognome","Qualifica \n(1)","Ruolo \n(2)",null,"Note \n(3)"]
[1,null,null,null,"Direzione"]
[null,null,null,null,"Direzione tecnica"]
[null,null,null,null,"Responsabile processi non subappaltabili"]
[null,null,null,null,"Responsabile del sistema di gestione"]
[null,null,null,null,"Operatore"]
[null,null,null,null,"Altro (specificare)"]
[{"$f":"A14+1","v":2},null,null,null,"Direzione"]
{"$rows_left_out":84}
{"sheet":"3 | Subappaltatori","index":3,"n_rows":29,"n_cols":7,"rows_kept":29,"cut":false,"hidden":false,"merged":[[21,0,24,0],[21,1,24,1],[21,2,24,2],[21,5,24,5],[21,6,24,6],[17,0,20,0],[17,1,20,1],[17,2,20,2],[17,5,20,5],[17,6,20,6],[25,0,28,0],[25,1,28,1],[25,2,28,2],[25,5,28,5],[25,6,28,6],[13,1,16,1],[13,2,16,2],[13,0,16,0],[13,6,16,6],[12,3,12,4],[13,5,16,5],[0,0,0,3],[10,1,10,6],[3,1,3,3],[9,1,9,6],[5,1,5,6],[8,1,8,6]]}
["Dipartimento Laboratori di Taratura"]
[{"$f":"REV_DA","v":"DA-09 rev. 01-05"}]
[]
["3","Subappaltatori"]
[]
["Scopo:","Fornire informazioni relative agli eventuali subappaltatori, ovvero organismi competenti ai quali il produttore di materiali di riferimento affida parte delle attività del processo di produzione.\nSi ricorda che \"subappaltatore\" è organismo (società o organizzazione pubblica o privata) che garantisce aspetti relativi alla lavorazione, alla manipolazione, alla valutazione dell’omogeneità e della stabilità, alla caratterizzazione, all’immagazzinamento o distribuzione dei materiali di riferimento a nome del Produttore di materiali di riferimento su base contrattuale onerosa o non onerosa."]
[]
["Note:"]
["(1)","Riportare l'identificativo di accreditamento, ove applicabile. Lasciare vuoto nel caso il subappaltatore non disponga di accreditamento."]
["(2)","Selezionare (possibilità di selezione multipla) le attività oggetto di subappalto."]
["(3)","Inserire ogni altra informazione si ritenga utile per meglio descrivere il rapporto contrattuale in essere con il subappaltatore (ad esempio, il riferimento al contratto - cfr. A.4 sez. Allegati)."]
[]
["ID","Ragione sociale","Indirizzo","Eventuali accreditamenti \n(1)",null,"Attività subappaltata\n (2)","Informazioni contrattuali \n(3)"]
["SC1",null,null,"Laboratorio di Taratura\n(UNI CEI EN ISO/IEC17025)"]
[null,null,null,"Laboratorio di Prova \n(UNI CEI EN ISO/IEC17025)"]
[null,null,null,"Laboratorio medico \n(UNI EN ISO 15189)"]
[null,null,null,"Altro (da specificare)"]
["SC2",null,null,"Laboratorio di Taratura\n(UNI CEI EN ISO/IEC17025)"]
[null,null,null,"Laboratorio di Prova \n(UNI CEI EN ISO/IEC17025)"]
[null,null,null,"Laboratorio medico \n(UNI EN ISO 15189)"]
{"$rows_left_out":10}
{"sheet":"4.1 | Scopo accreditamento CRM","index":4,"n_rows":74,"n_cols":13,"rows_kept":74,"cut":false,"hidden":false,"merged":[[10,1,10,7],[12,2,12,3],[6,1,6,7],[0,0,0,3],[3,1,3,10],[5,1,5,8],[8,1,8,7],[9,1,9,7]]}
["Dipartimento Laboratori di Taratura"]
[{"$f":"REV_DA","v":"DA-09 rev. 01-05"}]
[]
["4","Produzione di Materiali di Riferimento Certificati (CRM) oggetto dell’accreditamento"]
[]
["Scopo:","Indicare i settori (cfr. All. 1 alla presente DA-09), la composizione del materiale (matrice / analita), le propretà caratterizzate, i campi di misura e le incertezze estese per i quali il produttore chiede di essere accreditato"]
[null,"La compilazione di questa sezione è riservata ai soli Materiali di Riferimento Certificati (CRM) per i quali il produttore richiede accreditamento."]
["Note:"]
["(1)","Indicare eventuali variazioni rispetto alla attuale tabella di accreditamento (nel caso di domanda di Rinnovo o di Estensione/Riduzione/Modifica dello scopo). [Doppio click per selezionare/deselezionare]"]
["(2)","Indicare il metodo di caratterizzazione con riferimento alla ISO 17034."]
["(3)","Indicare la procedura (o le procedure) relative allo specifico oggetto di accreditamento, utilizzando il relativo ID di cui all'elenco delle procedure (sezione 5).",null,null,null,null,null,null,null,"Vai all'elenco procedure >>>"]
[]
[null,null,"Composizione del materiale"]
["Variazione\n(1)","Settore","Matrice","Analita","Tipologia","Proprietà","Campo di misura \n/ unità di misura","Incertezza estesa \n/ unità di misura","Metodo\n(2)","Procedura di riferimento\n(3)","Note"]
[null,null,null,null,"qualitativo",null,null,null,null,null,null,null,{"$f":"VLOOKUP(B15,_config!$A$3:$B$41,2)","v":{"$error":"#N/A"}}]
[null,null,null,null,"quantitativo",null,null,null,null,null,null,null,{"$f":"VLOOKUP(B16,_config!$A$3:$B$41,2)","v":{"$error":"#N/A"}}]
[null,null,null,null,null,null,null,null,null,null,null,null,{"$f":"VLOOKUP(B17,_config!$A$3:$B$41,2)","v":{"$error":"#N/A"}}]
[null,null,null,null,null,null,null,null,null,null,null,null,{"$f":"VLOOKUP(B18,_config!$A$3:$B$41,2)","v":{"$error":"#N/A"}}]
[null,null,null,null,null,null,null,null,null,null,null,null,{"$f":"VLOOKUP(B19,_config!$A$3:$B$41,2)","v":{"$error":"#N/A"}}]
[null,null,null,null,null,null,null,null,null,null,null,null,{"$f":"VLOOKUP(B20,_config!$A$3:$B$41,2)","v":{"$error":"#N/A"}}]
{"$rows_left_out":55}
{"sheet":"4.2 | Scopo accreditamento RM","index":5,"n_rows":74,"n_cols":13,"rows_kept":74,"cut":false,"hidden":false,"merged":[[10,1,10,7],[12,2,12,3],[12,6,12,7],[6,1,6,6],[0,0,0,3],[3,1,3,10],[5,1,5,8],[8,1,8,7],[9,1,9,7]]}
["Dipartimento Laboratori di Taratura"]
[{"$f":"REV_DA","v":"DA-09 rev. 01-05"}]
[]
["4","Produzione di Materiali di Riferimento (RM) oggetto dell’accreditamento"]
[]
["Scopo:","Indicare i settori (cfr. All. 1 alla presente DA-09), la composizione del materiale (matrice / analita), le propretà caratterizzate ed eventuali campi di misura e incertezze estese per i quali il produttore chiede di essere accreditato"]
[null,"La compilazione di questa sezione è riservata ai soli Materiali di Riferimento (RM) per i quali il produttore richiede accreditamento."]
["Note:"]
["(1)","Indicare eventuali variazioni rispetto alla attuale tabella di accreditamento (nel caso di domanda di Rinnovo o di Estensione/Riduzione/Modifica dello scopo). [Doppio click per selezionare/deselezionare]"]
["(2)","Indicare il metodo di caratterizzazione con riferimento alla ISO 17034."]
["(3)","Indicare la procedura (o le procedure) relative allo specifico oggetto di accreditamento, utilizzando il relativo ID di cui all'elenco delle procedure (sezione 5).",null,null,null,null,null,null,null,"Vai all'elenco procedure >>>"]
[]
[null,null,"Composizione del materiale",null,null,null,"se applicabili"]
["Variazione\n(1)","Settore","Matrice","Analita","Tipologia","Proprietà","Campo di misura \n/ unità di misura","Incertezza estesa \n/ unità di misura","Metodo\n(2)","Procedura di riferimento\n(3)","Note"]
[null,null,null,null,"qualitativo",null,null,null,null,null,null,null,{"$f":"VLOOKUP(B15,_config!$A$3:$B$41,2)","v":{"$error":"#N/A"}}]
[null,null,null,null,"quantitativo",null,null,null,null,null,null,null,{"$f":"VLOOKUP(B16,_config!$A$3:$B$41,2)","v":{"$error":"#N/A"}}]
[null,null,null,null,null,null,null,null,null,null,null,null,{"$f":"VLOOKUP(B17,_config!$A$3:$B$41,2)","v":{"$error":"#N/A"}}]
[null,null,null,null,null,null,null,null,null,null,null,null,{"$f":"VLOOKUP(B18,_config!$A$3:$B$41,2)","v":{"$error":"#N/A"}}]
[null,null,null,null,null,null,null,null,null,null,null,null,{"$f":"VLOOKUP(B19,_config!$A$3:$B$41,2)","v":{"$error":"#N/A"}}]
[null,null,null,null,null,null,null,null,null,null,null,null,{"$f":"VLOOKUP(B20,_config!$A$3:$B$41,2)","v":{"$error":"#N/A"}}]
{"$rows_left_out":55}
{"sheet":"4 | Scopo di accreditamento","index":6,"n_rows":75,"n_cols":13,"rows_kept":75,"cut":false,"hidden":true,"merged":[[3,1,3,10],[0,0,0,3],[13,2,13,3],[5,1,5,8],[9,1,9,7],[10,1,10,7],[8,1,8,7],[11,1,11,7]]}
["Dipartimento Laboratori di Taratura"]
[{"$f":"REV_DA","v":"DA-09 rev. 01-05"}]
[]
["4","Produzione di Materiali di Riferimento oggetto dell’accreditamento"]
[]
["Scopo:","Indicare i settori (cfr. All. 1 alla presente DA-09), la composizione del materiale (matrice / analita), le propretà caratterizzate, i campi di misura e le incertezze estese per i quali il produttore chiede di essere accreditato"]
[]
["Note:"]
["(1)","Indicare eventuali variazioni rispetto alla attuale tabella di accreditamento (nel caso di domanda di Rinnovo o di Estensione/Riduzione). [Doppio click per selezionare/deselezionare]"]
["(2)","Indicare se si tratta di Materiale di Riferimento Certificato, CRM (Certified Reference Material). [Doppio click per selezionare/deselezionare] "]
["(3)","Indicare il metodo di caratterizzazione con riferimento alla ISO 17034."]
["(4)","Indicare la procedura (o le procedure) relative allo specifico oggetto di accreditamento, utilizzando il relativo ID di cui all'elenco delle procedure (sezione 5).",null,null,null,null,null,null,null,"Vai all'elenco procedure >>>"]
[]
[null,null,"Composizione del materiale"]
["Variazione\n(1)","Settore","Matrice","Analita","CRM\n(2)","Proprietà","Campo di misura \n/ unità di misura","Incertezza estesa \n/ unità di misura","Metodo\n(3)","Procedura di riferimento\n(4)","Note"]
[null,null,null,null,null,null,null,null,null,null,null,null,{"$f":"VLOOKUP(B16,_config!$A$3:$B$41,2)","v":{"$error":"#N/A"}}]
[null,null,null,null,null,null,null,null,null,null,null,null,{"$f":"VLOOKUP(B17,_config!$A$3:$B$41,2)","v":{"$error":"#N/A"}}]
[null,null,null,null,null,null,null,null,null,null,null,null,{"$f":"VLOOKUP(B18,_config!$A$3:$B$41,2)","v":{"$error":"#N/A"}}]
[null,null,null,null,null,null,null,null,null,null,null,null,{"$f":"VLOOKUP(B19,_config!$A$3:$B$41,2)","v":{"$error":"#N/A"}}]
[null,null,null,null,null,null,null,null,null,null,null,null,{"$f":"VLOOKUP(B20,_config!$A$3:$B$41,2)","v":{"$error":"#N/A"}}]
{"$rows_left_out":56}
{"sheet":"5 | Documenti sistema gestione","index":7,"n_rows":63,"n_cols":6,"rows_kept":63,"cut":false,"hidden":false,"merged":[[0,0,0,3],[9,4,9,5],[10,1,10,3],[3,1,3,5],[8,1,8,3],[8,4,8,5],[5,1,5,5]]}
["Dipartimento Laboratori di Taratura"]
[{"$f":"REV_DA","v":"DA-09 rev. 01-05"}]
[]
["5","Documentazione del Sistema di Gestione - Procedure gestionali e tecniche"]
[]
["Scopo:","Identificare la documentazione del sistema di gestione (incluse procedure gestionali e tecniche) utilizzata dall'organismo, nello stato di revisione corrente e segnalando eventuali variazioni rispetto a precedenti versioni (già valutate positivamente da ACCREDIA-DT)."]
[]
["Note:"]
["(1)","Numero progressivo, da utilizzarsi nella descrizione della Tabella di Accreditamento (sezione 4).",null,null,"Vai alla Tabella di Accreditamento CRM >>>"]
[null,null,null,null,"Vai alla Tabella di Accreditamento RM >>>"]
["(2)","Indicare eventuali variazioni rispetto alle procedure già positivamente valutate da ACCREDIA-DT (nel caso di domanda di Rinnovo o di Estensione/Riduzione o di Modifica dello scopo di accreditamento). [Doppio click per selezionare/deselezionare]"]
[]
["ID\n(1)","Procedura tecnica / gestionale","Sigla / codice di identificazione","Titolo","Indice di revisione","Variazione\n(2)"]
[{"$f":"IF(B14=\"\",\"\",1)","v":""}]
[{"$f":"IF(B15=\"\",\"\",IF(A14=\"\",\"\",A14+1))","v":""}]
[{"$f":"IF(B16=\"\",\"\",IF(A15=\"\",\"\",A15+1))","v":""}]
[""]
[""]
[""]
[""]
{"$rows_left_out":44}
{"sheet":"6 | Campioni e strumenti","index":8,"n_rows":58,"n_cols":15,"rows_kept":58,"cut":false,"hidden":false,"merged":[[0,0,0,3],[3,1,3,14],[15,10,15,14],[8,1,8,14],[9,1,9,14],[11,1,11,14],[13,1,13,14],[10,1,10,14],[5,1,5,14],[12,1,12,9],[12,10,12,12]]}
["Dipartimento Laboratori di Taratura"]
[{"$f":"REV_DA","v":"DA-09 rev. 01-05"}]
[]
["6","Elenco dei campioni e/o strumenti"]
[]
["Scopo:","Riportare l'elenco completo dei campioni e degli strumenti (compresi quelli eventualmente non di proprietà) utilizzati dall'organismo per le produzioni oggetto di accreditamento."]
[]
["Note:"]
["(1)","Numero progressivo."]
["(2)","Indicare se (cfr. UNI CEI 70099:2008) \n- campione di misura di riferimento (cfr. §5.6) - in precedenza, \"campione di prima linea\" \n- campione di misura di lavoro (cfr. §5.7) - in precedenza, \"campione di seconda linea\"\n- campione di misura viaggiatore (cfr. §5.8)\n- dispositivo di misura di trasferimento (cfr. §5.9)\n- materiale di riferimento certificato (CRM).    "]
["(3)","Selezionare nel caso in cui il campione/strumento non sia di proprietà dell'organismo. [Doppio click per selezionare/deselezionare] Riportare il proprietario nella colonna successiva."]
["(4)","Selezionare se soggetto a taratura interna (cfr. RT-25), ovvero ad una taratura eseguita per stabilire la riferibilità metrologica delle proprie attività in relazione allo scopo di accreditamento e che\n- non rientra nello scopo di accreditamento del LAT (e come tale non può essere offerta come servizio di taratura accreditato),\n- viene eseguita mediante personale e strumentazione sotto il diretto ed esclusivo controllo del LAT o della organizzazione a cui il LAT appartiene, applicando procedure tecniche valutate positivamente da parte di ACCREDIA-DT."]
["(5)","Indicare la procedura (o le procedure) utilizzando il relativo ID di cui all'elenco delle procedure (sezione 5).",null,null,null,null,null,null,null,null,"Vai all'elenco procedure >>>"]
["(6)","Non indicare nel caso di taratura interna. [Doppio click per selezionare/deselezionare]"]
[]
[null,null,null,null,null,null,null,null,null,"Utilizzo","Taratura"]
["ID\n(1)","Tipo di strumento\n(2)","Non di proprietà\n(3)","Proprietario","Descrizione","Costruttore","Data di costruzione\n(anno)","Modello / tipo","Numero di matricola","Procedura\n(5)","Interna\n(4)","Periodicità\n(mesi)","Procedura\n(5)","Fornitore\n(6)","Numero / data dell'ultimo Certificato di Taratura"]
[1,"Materiale di riferimento certificato (CRM)"]
[{"$f":"IF(B19=\"\",\"\",IF(A18=\"\",\"\",(A18+1)))","v":""}]
[{"$f":"IF(B20=\"\",\"\",IF(A19=\"\",\"\",(A19+1)))","v":""}]
{"$rows_left_out":39}
{"sheet":"7 | Allegati","index":9,"n_rows":32,"n_cols":18,"rows_kept":32,"cut":false,"hidden":false,"merged":[[0,0,0,3],[7,1,7,10],[13,1,13,10],[15,1,15,10],[17,1,17,10],[11,1,11,10],[1,0,1,1],[1,16,2,18],[3,15,5,15],[3,16,5,16],[3,17,5,17],[5,1,5,10],[3,1,3,10],[3,11,5,11],[3,12,5,12],[3,13,5,13],[3,14,5,14],[1,12,2,12],[1,13,2,14],[1,15,2,15],[31,1,31,10],[29,1,29,10],[9,1,9,10],[25,1,25,10],[27,1,27,10],[19,1,19,10],[21,1,21,10],[23,1,23,10]]}
["Dipartimento Laboratori di Taratura"]
[{"$f":"REV_DA","v":"DA-09 rev. 01-05"},null,null,null,null,null,null,null,null,null,null,null,"X","Obbligatorio",null,"O","Limitatamente all'oggetto \ndella domanda"]
[]
["7","Allegati da inviare a corredo della presente domanda",null,null,null,null,null,null,null,null,null,"Accreditamento","Rinnovo\ncon/senza modifica scopo","Estensione","Modifica \nscopo di accreditamento","Adeguamento normativo","Riduzione","Variazione anagrafica /\nTrasferimento di titolarità"]
[]
["Nota:","Il mancato invio di tutti gli allegati richiesti rappresenta elemento sufficiente per la non accettabilità dell'intera domanda. "]
[]
["A.1","Piano di produzione",null,null,null,null,null,null,null,null,null,"X","X","X","X","X","X","O"]
[]
["A.2","Organigramma nominativo della struttura dell'organismo che richiede l'accreditamento come produttore di materiali di riferimento, nel quale siano almeno indicate le persone riportate nella sez. 2.",null,null,null,null,null,null,null,null,null,"X","X","O",null,null,"O","O"]
[]
["A.3","Curriculum professionale, datato e firmato, di tutto il personale indicato nella sezione 2.",null,null,null,null,null,null,null,null,null,"X","X","O",null,null,null,"O"]
[]
["A.4","Copia dei contratti in essere con i subappaltatori elencati nella sez. 3.",null,null,null,null,null,null,null,null,null,"X","X","X","O","O","O","X"]
[]
["A.5","Manuale del Sistema di Gestione in formato elettronico PDF (in distrbuzione controllata), in conformità a quanto previsto dalla norma ISO 17034, ai requisiti aggiuntivi di ACCREDIA, dell’EA e dell’ILAC.",null,null,null,null,null,null,null,null,null,"X","X","O","O",null,null,"O"]
[]
["A.6","Procedure gestionali e tecniche (come da elenco riportato in sez. 5) - e relativi allegati -, nell’ultima revisione, in formato elettronico PDF (in distribuzione controllata). ",null,null,null,null,null,null,null,null,null,"X","X","O","O","O","O"]
[]
["A.7","Copia dei Certificati di Taratura (in formato elettronico PDF) per i campioni di misura di riferimento in dotazione all'organismo e dei Certificati di materiale di riferimento certificato (in formato PDF) per i CRM eventualmente utilizzati.",null,null,null,null,null,null,null,null,null,"X","X","O","O"]
{"$rows_left_out":13}
{"sheet":"_config","index":10,"n_rows":41,"n_cols":10,"rows_kept":41,"cut":false,"hidden":true,"merged":[]}
["Grandezze",null,null,"Settore",null,"Tipo di procedura (tecnica/gestionale)",null,"Tipo di campione/strumento",null,"Domanda"]
[]
["(Grandezza non codificata)","NOCOD",null,"[SRM-01] Materiali di riferimento (RM o CRM) in matrice ambientale",null,"Tecnica",null,"Campione di misura di riferimento",null,"ACCREDITAMENTO"]
["[LAT] ACCELERAZIONE","SAC",null,"[SRM-02] Materiali di riferimento (RM o CRM) sintetici in soluzione",null,"Gestionale",null,"Campione di misura di lavoro",null,"RINNOVO con conferma dello scopo di accreditamento"]
["[LAT] ANGOLO PIANO","SAP",null,"[SRM-03] Materiali di riferimento (RM o CRM) gassosi",null,null,null,"Campione di misura viaggiatore",null,"RINNOVO con richiesta modifica dello scopo di accreditamento"]
["[LAT] ATTIVITA' CATALITICA","SCT",null,null,null,null,null,"Dispositivo di misura di trasferimento",null,"ESTENSIONE"]
["[LAT] CAMPO ELETTROMAGNETICO","SEM",null,null,null,null,null,"Materiale di riferimento certificato (CRM)",null,"MODIFICA dello scopo di accreditamento"]
["[LAT] CONCENTRAZIONE DI QUANTITA' DI SOSTANZA","SCQ",null,null,null,"Ruolo",null,null,null,"ADEGUAMENTO NORMATIVO"]
["[LAT] CONDUCIBILITA' ELETTROLITICA","SCL",null,null,null,null,null,null,null,"RIDUZIONE"]
["[LAT] DEFORMAZIONE","SDE",null,null,null,"Responsabile del Laboratorio",null,"Attività di produzione",null,"VARIAZIONE ANAGRAFICA o TRASFERIMENTO DI TITOLARITA'"]
["[LAT] DUREZZA","SDR",null,null,null,"Sostituto del Responsabile"]
["[LAT] FORZA","SFO",null,null,null,"Responsabile UOD",null,"Lavorazione materiale"]
["[LAT] FRAZIONE DI QUANTITA' DI SOSTANZA","SFQ",null,null,null,"Responsabile del Sistema di Gestione",null,"Manipolazione"]
["[LAT] INDUZIONE MAGNETICA","SIM",null,null,null,"Assistente del Responsabile del Sistema di Gestione",null,"Valutazione omogeneità"]
["[LAT] IRRADIANZA","SIR",null,"Tipologia RM",null,"Operatore",null,"Valutazione stabilità"]
["[LAT] LUNGHEZZA","SLN",null,null,null,null,null,"Caratterizzazione"]
["[LAT] MASSA","SMA",null,"quantitativo",null,null,null,"Immagazzinamento"]
["[LAT] MASSA VOLUMICA","SMV",null,"qualitativo",null,"Direzione",null,"Distribuzione"]
["[LAT] MISURE A RADIOFREQUENZA (RF)","SRF",null,null,null,"Direzione tecnica",null,"Altro"]
["[LAT] MISURE ACUSTICHE","SAU",null,null,null,"Responsabile processi non subappaltabili "]
{"$rows_left_out":21}